BDBM50448787 CHEMBL3128178
SMILES O[C@@H]([C@H]1CC[C@@H](Cc2ccc(NC(=O)[C@@H]3CCc4scnc34)cc2)N1)c1cccnc1
InChI Key InChIKey=OYURTPRHVJSKRC-DZCCDHAISA-N
Data  11 IC50  3 EC50
  Tab Delimited (TSV)   2D SDfile   Computed 3D by Vconf -m prep SDfile
Find this compound or compounds like it in BindingDB:
Activity Spreadsheet -- Enzyme Inhibition Constant Data from BindingDB
Found 14 hits for monomerid = 50448787
TargetSodium-dependent serotonin transporter(Homo sapiens (Human))
Merck Research Laboratories
Curated by ChEMBL
LigandPNGBDBM50448787(CHEMBL3128178)
Affinity DataIC50:  420nM. Assay description: Inhibition of human SERT expressed in HEK293 cells preincubated for 30 mins followed by fluorescent substrate addition measured after 30 mins by plat...
In DepthDetails ArticlePubMed
TargetBeta-3 adrenergic receptor(Homo sapiens (Human))
Merck Research Laboratories
Curated by ChEMBL
LigandPNGBDBM50448787(CHEMBL3128178)
Affinity DataEC50:  1.40nM. Assay description: Agonist activity at human beta3 adrenergic receptor expressed in CHO cells assessed as accumulation of cAMP after 30 mins by TR-FRET assay
In DepthDetails ArticlePubMed
TargetBeta-1 adrenergic receptor(Homo sapiens (Human))
Merck Research Laboratories
Curated by ChEMBL
LigandPNGBDBM50448787(CHEMBL3128178)
Affinity DataIC50: >2.00E+4nM. Assay description: Displacement of [125]I-cyanopindolol from recombinant human beta1 adrenergic receptor after 1 hr by scintillation counting method
In DepthDetails ArticlePubMed
TargetBeta-2 adrenergic receptor(Homo sapiens (Human))
Merck Research Laboratories
Curated by ChEMBL
LigandPNGBDBM50448787(CHEMBL3128178)
Affinity DataIC50: >2.00E+4nM. Assay description: Displacement of [125]I-cyanopindolol from human recombinant beta2 adrenergic receptor after 1 hr by scintillation counting method
In DepthDetails ArticlePubMed
TargetCytochrome P450 2C9(Homo sapiens (Human))
Merck Research Laboratories
Curated by ChEMBL
LigandPNGBDBM50448787(CHEMBL3128178)
Affinity DataIC50: >1.00E+5nM. Assay description: Inhibition of CYP2C9 in human liver microsomes assessed as diclofenac alpha'-hydroxylation
In DepthDetails ArticlePubMed
TargetCytochrome P450 2D6(Homo sapiens (Human))
Merck Research Laboratories
Curated by ChEMBL
LigandPNGBDBM50448787(CHEMBL3128178)
Affinity DataIC50:  7.90E+4nM. Assay description: Inhibition of CYP2D6 in human liver microsomes assessed as dextraomethorphan O-demethylation
In DepthDetails ArticlePubMed
TargetCytochrome P450 2C9(Homo sapiens (Human))
Merck Research Laboratories
Curated by ChEMBL
LigandPNGBDBM50448787(CHEMBL3128178)
Affinity DataIC50: >1.00E+5nM. Assay description: Inhibition of CYP2C9 in human liver microsomes assessed as diclofenac alpha'-hydroxylation
In DepthDetails ArticlePubMed
TargetPotassium voltage-gated channel subfamily H member 2(Homo sapiens (Human))
Merck Research Laboratories
Curated by ChEMBL
LigandPNGBDBM50448787(CHEMBL3128178)
Affinity DataIC50:  6.10E+3nM. Assay description: Binding affinity to human ERG channel
In DepthDetails ArticlePubMed
TargetVoltage-dependent L-type calcium channel subunit alpha-1C(Homo sapiens (Human))
Merck Research Laboratories
Curated by ChEMBL
LigandPNGBDBM50448787(CHEMBL3128178)
Affinity DataIC50: >3.00E+4nM. Assay description: Displacement of [3H]-diltiazem from human Cav1.2 channel
In DepthDetails ArticlePubMed
TargetSodium channel protein type 5 subunit alpha(Homo sapiens (Human))
Merck Research Laboratories
Curated by ChEMBL
LigandPNGBDBM50448787(CHEMBL3128178)
Affinity DataIC50: >3.00E+4nM. Assay description: Inhibition of human Nav1.2 channel expressed in Xenopus oocytes by two-intracellular microelectrode voltage clamp method
In DepthDetails ArticlePubMed
TargetCytochrome P450 2D6(Homo sapiens (Human))
Merck Research Laboratories
Curated by ChEMBL
LigandPNGBDBM50448787(CHEMBL3128178)
Affinity DataIC50:  7.88E+4nM. Assay description: Inhibition of CYP2D6 in human liver microsomes assessed as dextromethorphan O-demethylation
In DepthDetails ArticlePubMed
TargetBeta-3 adrenergic receptor(Canis familiaris)
Merck And
Curated by ChEMBL
LigandPNGBDBM50448787(CHEMBL3128178)
Affinity DataEC50:  5nM. Assay description: Agonist activity at dog beta-3 adrenergic receptor expressed in CHO cells assessed as increase in intracellular cAMP accumulation after 30 mins by ti...
In DepthDetails ArticlePubMed
TargetBeta-3 adrenergic receptor(Macaca mulatta)
Merck And
Curated by ChEMBL
LigandPNGBDBM50448787(CHEMBL3128178)
Affinity DataEC50:  2nM. Assay description: Agonist activity at rhesus monkey beta-3 adrenergic receptor expressed in CHO cells assessed as increase in intracellular cAMP accumulation after 30 ...
In DepthDetails ArticlePubMed
TargetCytochrome P450 3A4(Homo sapiens (Human))
Merck Research Laboratories
Curated by ChEMBL
LigandPNGBDBM50448787(CHEMBL3128178)
Affinity DataIC50: >1.00E+5nM. Assay description: Inhibition of CYP3A4 in human liver microsomes assessed as testosterone 6beta-hydroxylation
In DepthDetails ArticlePubMed