BDBM50448868 CHEMBL3125104
SMILES CCc1cc(C(=O)N[C@@H]2C[C@H](N(C2)C(=O)c2coc3ccccc23)C(=O)NCCO)n(CC)n1
InChI Key InChIKey=CDEGDZWZEXWVEK-APWZRJJASA-N
Data  1 IC50
  Tab Delimited (TSV)   2D SDfile   Computed 3D by Vconf -m prep SDfile
Find this compound or compounds like it in BindingDB:
Activity Spreadsheet -- Enzyme Inhibition Constant Data from BindingDB
Found 1 hit for monomerid = 50448868
TargetEnoyl-[acyl-carrier-protein] reductase [NADH](Mycobacterium tuberculosis (strain ATCC 25618 / H3...)
Glaxosmithkline
Curated by ChEMBL
LigandPNGBDBM50448868(CHEMBL3125104)
Affinity DataIC50:  3nM. Assay description: Inhibition of Mycobacterium tuberculosis full length biotinylated InhA (270 amino acids) using DDCoA as substrate assessed as NADH oxidation by fluor...
In DepthDetails ArticlePubMed