BDBM50449013 CHEMBL3125935
SMILES CCOC(=O)C1C(c2cccnc2)c2ccc3ccccc3c2OC1=N
InChI Key InChIKey=VEYCPXZBGOTEJZ-UHFFFAOYSA-N
Data  1 KI
  Tab Delimited (TSV)   2D SDfile   Computed 3D by Vconf -m prep SDfile
Find this compound or compounds like it in BindingDB:
Activity Spreadsheet -- Enzyme Inhibition Constant Data from BindingDB
Found 1 hit for monomerid = 50449013
TargetLeucyl-cystinyl aminopeptidase(Homo sapiens (Human))
Monash Institute Of Pharmaceutical Sciences
Curated by ChEMBL
LigandPNGBDBM50449013(CHEMBL3125935)
Affinity DataKi: >1.00E+5nM. Assay description: Inhibition of IRAP in HEKT cells assessed as hydrolysis of L-leucine-4-methyl-7-coumarinylamide after 30 mins
In DepthDetails ArticlePubMed