BDBM50449021 CHEMBL1556216
SMILES Oc1ccc2C(C(C#N)C(=N)Oc2c1)c1cccnc1
InChI Key InChIKey=MOMQMQGTUCKHEB-UHFFFAOYSA-N
Data  1 KI
  Tab Delimited (TSV)   2D SDfile   Computed 3D by Vconf -m prep SDfile
Find this compound or compounds like it in BindingDB:
Activity Spreadsheet -- Enzyme Inhibition Constant Data from BindingDB
Found 1 hit for monomerid = 50449021
TargetLeucyl-cystinyl aminopeptidase(Homo sapiens (Human))
Monash Institute Of Pharmaceutical Sciences
Curated by ChEMBL
LigandPNGBDBM50449021(CHEMBL1556216)
Affinity DataKi: >1.00E+5nM. Assay description: Inhibition of IRAP in HEKT cells assessed as hydrolysis of L-leucine-4-methyl-7-coumarinylamide after 30 mins
In DepthDetails ArticlePubMed