BDBM50449420 CHEMBL145021
SMILES O=c1oc(Cc2ccccc2)nc2ccccc12
InChI Key InChIKey=DDRPLKODWUPIEW-UHFFFAOYSA-N
Data  1 KI
  Tab Delimited (TSV)   2D SDfile   Computed 3D by Vconf -m prep SDfile
Find this compound or compounds like it in BindingDB:
Activity Spreadsheet -- Enzyme Inhibition Constant Data from BindingDB
Found 1 hit for monomerid = 50449420
TargetNeutrophil elastase(Homo sapiens (Human))
Syntex Research
Curated by ChEMBL
LigandPNGBDBM50449420(CHEMBL145021)
Affinity DataKi:  3.98E+3nM. Assay description: Component deacylation rate constant for interaction with human leukocyte elastaseChecked by Author
In DepthDetails ArticlePubMed