BDBM50449580 CHEMBL4174205
SMILES CSC1=N\C(=C/c2cccc(OCc3ccc(Cl)cc3)c2)C(=O)N1C
InChI Key InChIKey=QDRIEIXVKFKNBJ-BOPFTXTBSA-N
Data  2 KI  2 IC50  2 EC50
  Tab Delimited (TSV)   2D SDfile   Computed 3D by Vconf -m prep SDfile
Find this compound or compounds like it in BindingDB:
Activity Spreadsheet -- Enzyme Inhibition Constant Data from BindingDB
Found 6 hits for monomerid = 50449580
TargetCannabinoid receptor 1(Homo sapiens (Human))
University Of Bonn
Curated by ChEMBL
LigandPNGBDBM50449580(CHEMBL4174205)
Affinity DataKi: >1.00E+4nM. Assay description: Displacement of [3H]CP55940 from recombinant human CB1 receptor expressed in CHO cell membranes after 2 hrs by liquid scintillation counting method
Ligand InfoPC cidPC sid
In DepthDetails ArticlePubMed
TargetCannabinoid receptor 2(Homo sapiens (Human))
University Of Bonn
Curated by ChEMBL
LigandPNGBDBM50449580(CHEMBL4174205)
Affinity DataKi: >1.00E+4nM. Assay description: Displacement of [3H]CP55940 from recombinant human CB2 receptor expressed in CHO cell membranes after 2 hrs by liquid scintillation counting method
Ligand InfoPC cidPC sid
In DepthDetails ArticlePubMed
TargetG-protein coupled receptor 55(Homo sapiens (Human))
University Of Bonn
Curated by ChEMBL
LigandPNGBDBM50449580(CHEMBL4174205)
Affinity DataIC50: >1.00E+4nM. Assay description: Antagonist activity at recombinant human GPR55 expressed in CHO cells assessed as inhibition of lysophosphatidylinositol-induced beta-arrestin recrui...
Ligand InfoPC cidPC sid
In DepthDetails ArticlePubMed
TargetN-arachidonyl glycine receptor(Homo sapiens (Human))
University Of Bonn
Curated by ChEMBL
LigandPNGBDBM50449580(CHEMBL4174205)
Affinity DataEC50: >1.00E+4nM. Assay description: Agonist activity at recombinant human GPR18 expressed in CHO cells assessed as increase in beta-arrestin recruitment incubated for 60 mins measured f...
Ligand InfoPC cidPC sid
In DepthDetails ArticlePubMed
TargetG-protein coupled receptor 55(Homo sapiens (Human))
University Of Bonn
Curated by ChEMBL
LigandPNGBDBM50449580(CHEMBL4174205)
Affinity DataEC50: >1.00E+4nM. Assay description: Agonist activity at recombinant human GPR55 expressed in CHO cells assessed as increase in beta-arrestin recruitment incubated for 60 mins measured f...
Ligand InfoPC cidPC sid
In DepthDetails ArticlePubMed
TargetN-arachidonyl glycine receptor(Homo sapiens (Human))
University Of Bonn
Curated by ChEMBL
LigandPNGBDBM50449580(CHEMBL4174205)
Affinity DataIC50: >1.00E+4nM. Assay description: Antagonist activity at recombinant human GPR18 expressed in CHO cells assessed as inhibition of delta9-THC-induced beta-arrestin recruitment preincub...
Ligand InfoPC cidPC sid
In DepthDetails ArticlePubMed