BDBM50449900 CHEMBL4174805
SMILES CCOc1cc(ccc1C1=NC(C(N1C(=O)N1CCN(CCCCCCC(=O)NO)CC1)c1ccc(Cl)cc1)c1ccc(Cl)cc1)C(C)(C)C
InChI Key InChIKey=ODMAGXZOJNLPBL-UHFFFAOYSA-N
Data  1 KI  5 IC50
  Tab Delimited (TSV)   2D SDfile   Computed 3D by Vconf -m prep SDfile
Find this compound or compounds like it in BindingDB:
Activity Spreadsheet -- Enzyme Inhibition Constant Data from BindingDB
Found 6 hits for monomerid = 50449900
TargetE3 ubiquitin-protein ligase Mdm2(Homo sapiens (Human))
East China University Of Science And Technology
Curated by ChEMBL
LigandPNGBDBM50449900(CHEMBL4174805)
Affinity DataKi:  110nM. Assay description: Inhibition of MDM2 (unknown origin) preincubated for 30 mins by fluorescence polarization assay
Ligand InfoPC cidPC sid
In DepthDetails ArticlePubMed
TargetHistone deacetylase 8(Homo sapiens (Human))
East China University Of Science And Technology
Curated by ChEMBL
LigandPNGBDBM50449900(CHEMBL4174805)
Affinity DataIC50:  1.22E+3nM. Assay description: Inhibition of HDAC8 (unknown origin) after 30 mins by fluorescence assay
Ligand InfoPC cidPC sid
In DepthDetails ArticlePubMed
TargetHistone deacetylase 2(Homo sapiens (Human))
East China University Of Science And Technology
Curated by ChEMBL
LigandPNGBDBM50449900(CHEMBL4174805)
Affinity DataIC50:  421nM. Assay description: Inhibition of HDAC2 (unknown origin) after 30 mins by fluorescence assay
Ligand InfoPC cidPC sid
In DepthDetails ArticlePubMed
TargetHistone deacetylase 6(Homo sapiens (Human))
East China University Of Science And Technology
Curated by ChEMBL
LigandPNGBDBM50449900(CHEMBL4174805)
Affinity DataIC50:  18nM. Assay description: Inhibition of HDAC6 (unknown origin) after 30 mins by fluorescence assay
Ligand InfoPC cidPC sid
In DepthDetails ArticlePubMed
TargetHistone deacetylase 3(Homo sapiens (Human))
East China University Of Science And Technology
Curated by ChEMBL
LigandPNGBDBM50449900(CHEMBL4174805)
Affinity DataIC50:  178nM. Assay description: Inhibition of HDAC3 (unknown origin) after 30 mins by fluorescence assay
Ligand InfoPC cidPC sid
In DepthDetails ArticlePubMed
TargetHistone deacetylase 1(Homo sapiens (Human))
East China University Of Science And Technology
Curated by ChEMBL
LigandPNGBDBM50449900(CHEMBL4174805)
Affinity DataIC50:  820nM. Assay description: Inhibition of human recombinant full length HDAC1 using fluorogenic substrate 3 after 30 mins by fluorescence assay
Ligand InfoPC cidPC sid
In DepthDetails ArticlePubMed