BDBM50450119 CHEMBL4167180
SMILES Cn1c(COc2cccc(c2)C(O)=O)nc2cnc(Oc3ccc(Cl)c(F)c3)cc12
InChI Key InChIKey=BHXRPIJAPPYOTD-UHFFFAOYSA-N
Data  2 EC50
  Tab Delimited (TSV)   2D SDfile   Computed 3D by Vconf -m prep SDfile
Find this compound or compounds like it in BindingDB:
Activity Spreadsheet -- Enzyme Inhibition Constant Data from BindingDB
Found 2 hits for monomerid = 50450119
TargetPeroxisome proliferator-activated receptor alpha(Homo sapiens (Human))
Daiichi Sankyo
Curated by ChEMBL
LigandPNGBDBM50450119(CHEMBL4167180)
Affinity DataEC50: >1.00E+4nM. Assay description: Agonist activity at recombinant human GAL4-DBD fused PPARalpha LBD expressed in COS7 cells after 24 hrs by luciferase reporter gene assay
Ligand InfoPC cidPC sid
In DepthDetails ArticlePubMed
TargetPeroxisome proliferator-activated receptor gamma(Homo sapiens (Human))
Daiichi Sankyo
Curated by ChEMBL
LigandPNGBDBM50450119(CHEMBL4167180)
Affinity DataEC50:  1.17E+3nM. Assay description: Agonist activity at recombinant human GAL4-DBD fused PPARgamma LBD expressed in COS7 cells after 24 hrs by luciferase reporter gene assay
Ligand InfoPC cidPC sid
In DepthDetails ArticlePubMed