BDBM50450360 CHEMBL49855
SMILES CN(C)c1ccc(cc1)-c1nc(SCCOCCSc2[nH]cnc3ncnc23)[nH]c1-c1ccc(cc1)N(C)C
InChI Key InChIKey=WFIQDVPAUBZOOG-UHFFFAOYSA-N
Data  2 IC50
  Tab Delimited (TSV)   2D SDfile   Computed 3D by Vconf -m prep SDfile
Find this compound or compounds like it in BindingDB:
Activity Spreadsheet -- Enzyme Inhibition Constant Data from BindingDB
Found 2 hits for monomerid = 50450360
TargetSterol O-acyltransferase 1(Rattus norvegicus)
Dupont Pharmaceuticals
Curated by ChEMBL
LigandPNGBDBM50450360(CHEMBL49855)
Affinity DataIC50:  2.04E+3nM. Assay description: In vitro inhibition of Acyl coenzyme A:cholesterol acyltransferase (ACAT) in rat hepatic microsomes
In DepthDetails
TargetSterol O-acyltransferase 1(Mus musculus)
Dupont Pharmaceuticals
Curated by ChEMBL
LigandPNGBDBM50450360(CHEMBL49855)
Affinity DataIC50:  2.99E+3nM. Assay description: Inhibition of Acyl coenzyme A:cholesterol acyltransferase (ACAT) in J774 Macrophage cell culture
In DepthDetails