BDBM50450530 CHEMBL3084932
SMILES [H][C@]12CC[C@]([H])(C[C@@H](C1)OC(c1ccc(F)cc1)c1ccc(F)cc1)N2CCCCc1ccc(N=[N+]=[N-])c(I)c1
InChI Key InChIKey=JOXZYSCOYUCGGH-UQWUFBTJSA-N
Data  1 KI
  Tab Delimited (TSV)   2D SDfile   Computed 3D by Vconf -m prep SDfile
Find this compound or compounds like it in BindingDB:
Activity Spreadsheet -- Enzyme Inhibition Constant Data from BindingDB
Found 1 hit for monomerid = 50450530
TargetSodium-dependent dopamine transporter(Rattus norvegicus (rat))
TBA
Curated by ChEMBL
LigandPNGBDBM50450530(CHEMBL3084932)
Affinity DataKi:  159nM. Assay description: The compound was tested for binding affinity towards dopamine transporter in rat caudate putamen
In DepthDetails Article