BDBM50450747 CHEMBL95132
SMILES Clc1cncc(OC[C@H]2CCN2)c1
InChI Key InChIKey=MFEGWOBZTGPLEC-MRVPVSSYSA-N
Data  1 KI
  Tab Delimited (TSV)   2D SDfile   Computed 3D by Vconf -m prep SDfile
Find this compound or compounds like it in BindingDB:
Activity Spreadsheet -- Enzyme Inhibition Constant Data from BindingDB
Found 1 hit for monomerid = 50450747
TargetNeuronal acetylcholine receptor subunit alpha-4/beta-2(Rattus norvegicus (Rat))
Abbott Laboratories
Curated by ChEMBL
LigandPNGBDBM50450747(CHEMBL95132)
Affinity DataKi:  0.120nM. Assay description: Binding affinity towards Nicotinic acetylcholine receptor alpha4-beta2 in rat brain using [3H]-cytisine as radioligand
In DepthDetails ArticlePubMed