BDBM50450749 CHEMBL94626
SMILES NCc1cncc(OC[C@@H]2CCN2)c1
InChI Key InChIKey=SJRPBOIYIJEXKQ-VIFPVBQESA-N
Data  1 KI
  Tab Delimited (TSV)   2D SDfile   Computed 3D by Vconf -m prep SDfile
Find this compound or compounds like it in BindingDB:
Activity Spreadsheet -- Enzyme Inhibition Constant Data from BindingDB
Found 1 hit for monomerid = 50450749
TargetNeuronal acetylcholine receptor subunit alpha-4/beta-2(Rattus norvegicus (Rat))
Abbott Laboratories
Curated by ChEMBL
LigandPNGBDBM50450749(CHEMBL94626)
Affinity DataKi:  4.40nM. Assay description: Binding affinity towards Nicotinic acetylcholine receptor alpha4-beta2 in rat brain using [3H]-cytisine as radioligand
In DepthDetails ArticlePubMed