BDBM50450820 CHEMBL4210376
SMILES Oc1c(Cl)cc(NC(=S)Nc2ccc3[nH]ccc3c2)cc1Cl
InChI Key InChIKey=XSYQZAORSLFEAF-UHFFFAOYSA-N
Data  3 IC50
  Tab Delimited (TSV)   2D SDfile   Computed 3D by Vconf -m prep SDfile
Find this compound or compounds like it in BindingDB:
Activity Spreadsheet -- Enzyme Inhibition Constant Data from BindingDB
Found 3 hits for monomerid = 50450820
TargetPeroxidase(Raphanus sativus)
Charles University In Prague
Curated by ChEMBL
LigandPNGBDBM50450820(CHEMBL4210376)
Affinity DataIC50:  1.06E+3nM. Assay description: Inhibition of horse radish peroxidase assessed as residual activity by amplex red dye based fluorescence assay
Ligand InfoPC cidPC sid
In DepthDetails ArticlePubMed
TargetAmine oxidase [flavin-containing] B(Homo sapiens (Human))
Charles University In Prague
Curated by ChEMBL
LigandPNGBDBM50450820(CHEMBL4210376)
Affinity DataIC50:  1.70E+4nM. Assay description: Inhibition of human membrane bound MAO-B expressed in insect cell membranes assessed as reduction in conversion of kynuramine to 4-hydroxyquinoline b...
Ligand InfoPC cidPC sid
In DepthDetails ArticlePubMed
TargetAmine oxidase [flavin-containing] A(Homo sapiens (Human))
Charles University In Prague
Curated by ChEMBL
LigandPNGBDBM50450820(CHEMBL4210376)
Affinity DataIC50: >1.00E+5nM. Assay description: Inhibition of human membrane bound MAO-A expressed in insect cell membranes assessed as reduction in conversion of kynuramine to 4-hydroxyquinoline b...
Ligand InfoPC cidPC sid
In DepthDetails ArticlePubMed