BDBM50450887 CHEMBL4211367
SMILES Cn1cc(Nc2nc(N[C@H]3CN(C[C@@H]3F)C(=O)C=C)c3c(Cl)c[nH]c3n2)cn1
InChI Key InChIKey=YTOUVESELJLHFC-RYUDHWBXSA-N
Data  1 KI
  Tab Delimited (TSV)   2D SDfile   Computed 3D by Vconf -m prep SDfile
Find this compound or compounds like it in BindingDB:
Activity Spreadsheet -- Enzyme Inhibition Constant Data from BindingDB
Found 1 hit for monomerid = 50450887
TargetEpidermal growth factor receptor(Homo sapiens (Human))
Wuxi Apptec
Curated by ChEMBL
LigandPNGBDBM50450887(CHEMBL4211367)
Affinity DataKi:  3nM. Assay description: Inhibition of EGFR T790M/L858R double mutant (unknown origin)
Ligand InfoPC cidPC sid
In DepthDetails ArticlePubMed