BDBM50451051 CHEMBL4210471
SMILES O=C(NCCCN1CCN(Cc2ccc3OCOc3c2)CC1)c1ccccn1
InChI Key InChIKey=WRRIRYQLTJZUKS-UHFFFAOYSA-N
Data  3 KI  1 EC50
  Tab Delimited (TSV)   2D SDfile   Computed 3D by Vconf -m prep SDfile
Find this compound or compounds like it in BindingDB:
Activity Spreadsheet -- Enzyme Inhibition Constant Data from BindingDB
Found 4 hits for monomerid = 50451051
Target5-hydroxytryptamine receptor 2A(Rattus norvegicus (rat))
Dipartimento Di Farmacia Universit£
Curated by ChEMBL
LigandPNGBDBM50451051(CHEMBL4210471)
Affinity DataKi:  45nM. Assay description: Displacement of [3H]ketanserin from serotonin 5-HT2A receptor in Sprague-Dawley rat brain cortex homogenates incubated for 15 mins by liquid scintill...
Ligand InfoPC cidPC sid
In DepthDetails ArticlePubMed
Target5-hydroxytryptamine receptor 2C(Rattus norvegicus (Rat))
Dipartimento Di Farmacia Universit£
Curated by ChEMBL
LigandPNGBDBM50451051(CHEMBL4210471)
Affinity DataKi: >1.00E+4nM. Assay description: Displacement of [3H]mesulergine from serotonin 5-HT2C receptor in Sprague-Dawley rat brain cortex homogenates incubated for 15 mins by liquid scintil...
Ligand InfoPC cidPC sid
In DepthDetails ArticlePubMed
Target5-hydroxytryptamine receptor 1A(Rattus norvegicus (rat))
Dipartimento Di Farmacia Universit£
Curated by ChEMBL
LigandPNGBDBM50451051(CHEMBL4210471)
Affinity DataKi: >1.00E+4nM. Assay description: Displacement of [3H]-8-OH-DPAT from serotonin 5-HT1A receptor in Sprague-Dawley rat brain cortex homogenates incubated for 30 mins by liquid scintill...
Ligand InfoPC cidPC sid
In DepthDetails ArticlePubMed
Target5-hydroxytryptamine receptor 2A(Rattus norvegicus (rat))
Dipartimento Di Farmacia Universit£
Curated by ChEMBL
LigandPNGBDBM50451051(CHEMBL4210471)
Affinity DataEC50:  6.48E+3nM. Assay description: Antagonist activity at 5-HT2A receptor in Sprague-Dawley rat ielum assessed as reduction in 5-HT-evoked contraction
Ligand InfoPC cidPC sid
In DepthDetails ArticlePubMed