BDBM50451150 CHEMBL3138219
SMILES [H][C@@]12CCC(=O)[C@@]1(C)CC[C@@]1([H])[C@@]2([H])CCC2C[C@](O)(CC[C@]12C)C(C)CC
InChI Key InChIKey=HIGRNMBHEGUXBW-XQBUTOGESA-N
Data  1 IC50
  Tab Delimited (TSV)   2D SDfile   Computed 3D by Vconf -m prep SDfile
Find this compound or compounds like it in BindingDB:
Activity Spreadsheet -- Enzyme Inhibition Constant Data from BindingDB
Found 1 hit for monomerid = 50451150
Target17-beta-hydroxysteroid dehydrogenase type 3(Homo sapiens (Human))
Laval University
Curated by ChEMBL
LigandPNGBDBM50451150(CHEMBL3138219)
Affinity DataIC50:  73nM. Assay description: Inhibitory concentration against type-3 17-beta-HSD expressed in HEK293 cells
In DepthDetails ArticlePubMed