BDBM50451193 CHEMBL14699
SMILES COc1cc2ncnc(Nc3ccc(F)c(Cl)c3)c2cc1OCCN1CCOCC1
InChI Key InChIKey=STNFCUFBMSVMBL-UHFFFAOYSA-N
Data  1 IC50
  Tab Delimited (TSV)   2D SDfile   Computed 3D by Vconf -m prep SDfile
Find this compound or compounds like it in BindingDB:
Activity Spreadsheet -- Enzyme Inhibition Constant Data from BindingDB
Found 1 hit for monomerid = 50451193
TargetEpidermal growth factor receptor(Homo sapiens (Human))
Astrazeneca
Curated by ChEMBL
LigandPNGBDBM50451193(CHEMBL14699)
Affinity DataIC50:  10nM. Assay description: In vitro inhibitory activity against Epidermal growth factor receptor (EGFR-TK) from A431 vulval squamous carcinoma cells using TKI assay
In DepthDetails ArticlePubMed