BDBM50451519 CHEMBL12733
SMILES CN(Cc1ccccc1)C(c1cccc2nc(O)c(O)nc12)P(O)(O)=O
InChI Key InChIKey=QJEFKTCXLNVCHX-UHFFFAOYSA-N
Data  2 IC50
  Tab Delimited (TSV)   2D SDfile   Computed 3D by Vconf -m prep SDfile
Find this compound or compounds like it in BindingDB:
Activity Spreadsheet -- Enzyme Inhibition Constant Data from BindingDB
Found 2 hits for monomerid = 50451519
TargetGlutamate receptor ionotropic, NMDA 1/2B(Homo sapiens (Human))
Novartis Pharma
Curated by ChEMBL
LigandPNGBDBM50451519(CHEMBL12733)
Affinity DataIC50:  3.00E+4nM. Assay description: Inhibitory activity against Xenopus laevis oocyte expressing 1A/2A heteromeric human NMDA (hNMDA) receptor
In DepthDetails ArticlePubMed
TargetGlutamate receptor ionotropic, NMDA 1/2A(Homo sapiens (Human))
Novartis Pharma
Curated by ChEMBL
LigandPNGBDBM50451519(CHEMBL12733)
Affinity DataIC50:  600nM. Assay description: Inhibitory activity against Xenopus laevis oocyte expressing 1A/2A heteromeric human NMDA (hNMDA) receptor
In DepthDetails ArticlePubMed