BDBM50451770 CHEMBL350614
SMILES Clc1cccc(CNC(=N)\C=C\c2ccccc2)c1Cl
InChI Key InChIKey=NJOJLSWUQNMZBT-MDZDMXLPSA-N
Data  1 KI
  Tab Delimited (TSV)   2D SDfile   Computed 3D by Vconf -m prep SDfile
Find this compound or compounds like it in BindingDB:
Activity Spreadsheet -- Enzyme Inhibition Constant Data from BindingDB
Found 1 hit for monomerid = 50451770
TargetGlutamate receptor ionotropic, NMDA 1/2B(Homo sapiens (Human))
Merck Sharp & Dohme Research Laboratories
Curated by ChEMBL
LigandPNGBDBM50451770(CHEMBL350614)
Affinity DataKi:  3.60nM. Assay description: Displacement of [3H]ifenprodil binding to recombinant human NR1a/NR2B receptors expressed in L(tk-) cells
In DepthDetails ArticlePubMed