BDBM50451802 CHEMBL163552
SMILES C(N1CCCC1c1cccnc1)c1ccccc1
InChI Key InChIKey=OROZJANMNGFCRU-UHFFFAOYSA-N
Data  1 KI
  Tab Delimited (TSV)   2D SDfile   Computed 3D by Vconf -m prep SDfile
Find this compound or compounds like it in BindingDB:
Activity Spreadsheet -- Enzyme Inhibition Constant Data from BindingDB
Found 1 hit for monomerid = 50451802
TargetNeuronal acetylcholine receptor subunit alpha-4/beta-2(Rattus norvegicus (Rat))
Virginia Commonwealth University
Curated by ChEMBL
LigandPNGBDBM50451802(CHEMBL163552)
Affinity DataKi:  360nM. Assay description: Affinity at alpha4-beta2 nACh receptors in rat brain (minus cerebellum) homogenates.
In DepthDetails ArticlePubMed