BDBM50452360 CHEMBL4202990
SMILES COc1ccc(\C=C\C(=O)c2ccncc2)cc1OC
InChI Key InChIKey=BPKKHYFGTSUNIU-UHFFFAOYSA-N
Data  14 IC50
  Tab Delimited (TSV)   2D SDfile   Computed 3D by Vconf -m prep SDfile
Find this compound or compounds like it in BindingDB:
Activity Spreadsheet -- Enzyme Inhibition Constant Data from BindingDB
Found 14 hits for monomerid = 50452360
TargetCytochrome P450 2C19(Homo sapiens (Human))
De Montfort University
Curated by ChEMBL
LigandPNGBDBM50452360(CHEMBL4202990)
Affinity DataIC50: >1.00E+4nM. Assay description: Inhibition of recombinant human CYP2C19 expressed in HEK293 cells using 3-cyano-7-ethoxycoumarin as substrate pretreated for 30 mins followed by subs...
In DepthDetails ArticlePubMed
TargetCytochrome P450 1A1(Homo sapiens (Human))
De Montfort University
Curated by ChEMBL
LigandPNGBDBM50452360(CHEMBL4202990)
Affinity DataIC50:  420nM. Assay description: Inhibition of recombinant human CYP1A1 expressed in HEK293 cells using 7-ethoxyresorufin as substrate pretreated for 30 mins followed by substrate ad...
In DepthDetails ArticlePubMed
TargetCytochrome P450 1A1(Homo sapiens (Human))
De Montfort University
Curated by ChEMBL
LigandPNGBDBM50452360(CHEMBL4202990)
Affinity DataIC50:  380nM. Assay description: Inhibition of human CYP1A1 expressed in yeast microsomal membranes using 7-ethoxyresorufin as substrate measured after 10 mins by fluorescence assay
In DepthDetails ArticlePubMed
TargetCytochrome P450 2C9(Homo sapiens (Human))
De Montfort University
Curated by ChEMBL
LigandPNGBDBM50452360(CHEMBL4202990)
Affinity DataIC50: >1.00E+4nM. Assay description: Inhibition of recombinant human CYP2C9 expressed in HEK293 cells using 3-cyano-7-ethoxycoumarin as substrate pretreated for 30 mins followed by subst...
In DepthDetails ArticlePubMed
TargetCytochrome P450 2C9(Homo sapiens (Human))
De Montfort University
Curated by ChEMBL
LigandPNGBDBM50452360(CHEMBL4202990)
Affinity DataIC50: >2.00E+4nM. Assay description: Inhibition of human CYP2C9 expressed in yeast microsomal membranes using 3-cyano-7-ethoxycoumarin as substrate measured after 10 mins by fluorescence...
In DepthDetails ArticlePubMed
TargetCytochrome P450 3A4(Homo sapiens (Human))
De Montfort University
Curated by ChEMBL
LigandPNGBDBM50452360(CHEMBL4202990)
Affinity DataIC50: >2.00E+4nM. Assay description: Inhibition of human CYP3A4 expressed in yeast microsomal membranes using dibenzylfluorescein as substrate measured after 10 mins by fluorescence assa...
In DepthDetails ArticlePubMed
TargetCytochrome P450 1A2(Homo sapiens (Human))
De Montfort University
Curated by ChEMBL
LigandPNGBDBM50452360(CHEMBL4202990)
Affinity DataIC50:  120nM. Assay description: Inhibition of recombinant human CYP1A2 expressed in HEK293 cells using 3-cyano-7-ethoxycoumarin as substrate pretreated for 30 mins followed by subst...
In DepthDetails ArticlePubMed
TargetCytochrome P450 2D6(Homo sapiens (Human))
De Montfort University
Curated by ChEMBL
LigandPNGBDBM50452360(CHEMBL4202990)
Affinity DataIC50: >1.00E+4nM. Assay description: Inhibition of recombinant human CYP2D6 expressed in HEK293 cells using 7-ethoxy-methyloxy-3-cyanocoumarin as substrate pretreated for 30 mins followe...
In DepthDetails ArticlePubMed
TargetCytochrome P450 3A4(Homo sapiens (Human))
De Montfort University
Curated by ChEMBL
LigandPNGBDBM50452360(CHEMBL4202990)
Affinity DataIC50: >1.00E+4nM. Assay description: Inhibition of recombinant human CYP3A4 expressed in HEK293 cells using dibenzylfluorescein as substrate pretreated for 30 mins followed by substrate ...
In DepthDetails ArticlePubMed
TargetCytochrome P450 2C19(Homo sapiens (Human))
De Montfort University
Curated by ChEMBL
LigandPNGBDBM50452360(CHEMBL4202990)
Affinity DataIC50: >2.00E+4nM. Assay description: Inhibition of human CYP2C19 expressed in yeast microsomal membranes using 3-cyano-7-ethoxycoumarin as substrate measured after 10 mins by fluorescenc...
In DepthDetails ArticlePubMed
TargetCytochrome P450 1B1(Homo sapiens (Human))
De Montfort University
Curated by ChEMBL
LigandPNGBDBM50452360(CHEMBL4202990)
Affinity DataIC50:  230nM. Assay description: Inhibition of recombinant human CYP1B1 expressed in HEK293 cells using 7-ethoxyresorufin as substrate pretreated for 30 mins followed by substrate ad...
In DepthDetails ArticlePubMed
TargetCytochrome P450 1B1(Homo sapiens (Human))
De Montfort University
Curated by ChEMBL
LigandPNGBDBM50452360(CHEMBL4202990)
Affinity DataIC50:  170nM. Assay description: Inhibition of human CYP1B1 expressed in yeast microsomal membranes using 7-ethoxyresorufin as substrate measured after 10 mins by fluorescence assay
In DepthDetails ArticlePubMed
TargetCytochrome P450 2D6(Homo sapiens (Human))
De Montfort University
Curated by ChEMBL
LigandPNGBDBM50452360(CHEMBL4202990)
Affinity DataIC50:  8.00E+3nM. Assay description: Inhibition of human CYP2D6 expressed in yeast microsomal membranes using 7-ethoxy-methyloxy-3-cyanocoumarin as substrate measured after 10 mins by fl...
In DepthDetails ArticlePubMed
TargetCytochrome P450 1A2(Homo sapiens (Human))
De Montfort University
Curated by ChEMBL
LigandPNGBDBM50452360(CHEMBL4202990)
Affinity DataIC50:  120nM. Assay description: Inhibition of human CYP1A2 expressed in yeast microsomal membranes using 3-cyano-7-ethoxycoumarin as substrate measured after 10 mins by fluorescence...
In DepthDetails ArticlePubMed