BDBM50452429 CHEMBL2110170
SMILES [H][C@@]12[C@H](C(=O)OCC)[C@@](C)(Sc3ccccc13)N=C(C)\C2=C(\O)OCC
InChI Key InChIKey=SZFUOECQXGHHAE-RAQPGAAPSA-N
Data  1 KI
  Tab Delimited (TSV)   2D SDfile   Computed 3D by Vconf -m prep SDfile
Find this compound or compounds like it in BindingDB:
Activity Spreadsheet -- Enzyme Inhibition Constant Data from BindingDB
Found 1 hit for monomerid = 50452429
TargetVoltage-dependent L-type calcium channel subunit alpha-1C(Homo sapiens (Human))
TBA
Curated by ChEMBL
LigandPNGBDBM50452429(CHEMBL2110170)
Affinity DataKi:  5.00E+3nM. Assay description: Inhibition of [3H]nitrendipine binding to L-type calcium channel dihydropyridine site of porcine cardiac sarcolemma membrane vesicles
In DepthDetails ArticlePubMed