BDBM50452720 CHEMBL4212285
SMILES CC(C)n1cc(Nc2nc(N)cc(n2)-c2cccc(c2CO)-n2ccc3cc(cc(F)c3c2=O)C2CC2)cn1
InChI Key InChIKey=MLEHATRHJWXEBQ-UHFFFAOYSA-N
Data  2 IC50
  Tab Delimited (TSV)   2D SDfile   Computed 3D by Vconf -m prep SDfile
Find this compound or compounds like it in BindingDB:
Activity Spreadsheet -- Enzyme Inhibition Constant Data from BindingDB
Found 2 hits for monomerid = 50452720
TargetTyrosine-protein kinase BTK(Homo sapiens (Human))
Carna Biosciences
Curated by ChEMBL
LigandPNGBDBM50452720(CHEMBL4212285)
Affinity DataIC50:  0.200nM. Assay description: Inhibition of His-tagged lambda phosphatase pre-treated N-terminal DYKDDDDK tagged and biotinylated BTK unactivated form (unknown origin) using FITC-...
Ligand InfoPC cidPC sid
In DepthDetails ArticlePubMed
TargetTyrosine-protein kinase BTK(Homo sapiens (Human))
Carna Biosciences
Curated by ChEMBL
LigandPNGBDBM50452720(CHEMBL4212285)
Affinity DataIC50:  2.60nM. Assay description: Inhibition of N-terminal DYKDDDDK tagged and biotinylated BTK activated form (unknown origin) using FITC-labeled Srctide substrate and ATP by microfl...
Ligand InfoPC cidPC sid
In DepthDetails ArticlePubMed