BDBM50452875 CHEMBL4212046
SMILES [H][C@]12CSC(N)=N[C@]1(CO[C@@H](C)C2)c1ncc(s1)C(=O)Nc1cccc(OC)n1
InChI Key InChIKey=JQPUNKDGBVSSQO-FHGNATFXSA-N
Data  4 IC50
  Tab Delimited (TSV)   2D SDfile   Computed 3D by Vconf -m prep SDfile
Find this compound or compounds like it in BindingDB:
Activity Spreadsheet -- Enzyme Inhibition Constant Data from BindingDB
Found 4 hits for monomerid = 50452875
TargetBeta-secretase 1(Homo sapiens (Human))
Pfizer
Curated by ChEMBL
LigandPNGBDBM50452875(CHEMBL4212046)
Affinity DataIC50:  0.0330nM. Assay description: Inhibition of BACE1 in human H4 cells transfected with wild type APP assessed as reduction in soluble portion of APPbeta level in cells incubated for...
Ligand InfoPC cidPC sid
In DepthDetails ArticlePubMed
TargetCathepsin D(Homo sapiens (Human))
Pfizer
Curated by ChEMBL
LigandPNGBDBM50452875(CHEMBL4212046)
Affinity DataIC50: >1.00E+5nM. Assay description: Inhibition of Cathepsin D (unknown origin) by fluorescence polarization assay
Ligand InfoPC cidPC sid
In DepthDetails ArticlePubMed
TargetPotassium voltage-gated channel subfamily H member 2(Homo sapiens (Human))
Pfizer
Curated by ChEMBL
LigandPNGBDBM50452875(CHEMBL4212046)
Affinity DataIC50:  4.80E+3nM. Assay description: Inhibition of human ERG expressed in CHOK1 cells for 5 mins at -80 mV holding potential by patch clamp method
Ligand InfoPC cidPC sid
In DepthDetails ArticlePubMed
TargetBeta-secretase 1(Homo sapiens (Human))
Pfizer
Curated by ChEMBL
LigandPNGBDBM50452875(CHEMBL4212046)
Affinity DataIC50:  110nM. Assay description: Inhibition of human BACE1 using biotin-GLTNIKTEEISEISYEVEFR-C[Oregon green]KK-OH as substrate after 3 hrs by fluorescence polarization assay
Ligand InfoPC cidPC sid
In DepthDetails ArticlePubMed