BDBM50452895 CHEMBL4206214
SMILES [#6]-[#8]-c1ccc(cc1)-[#6@@H]-1-[#8]-[#6](=O)-[#6](-[#6]-[#6]\[#6]=[#6](/[#6])-[#6]-[#6]\[#6]=[#6](\[#6])-[#6])=[#6]-1
InChI Key InChIKey=MKXKDMNFPVJSFE-DDPFVEHASA-N
Data  1 IC50
  Tab Delimited (TSV)   2D SDfile   Computed 3D by Vconf -m prep SDfile
Find this compound or compounds like it in BindingDB:
Activity Spreadsheet -- Enzyme Inhibition Constant Data from BindingDB
Found 1 hit for monomerid = 50452895
Target3-hydroxy-3-methylglutaryl-coenzyme A reductase(Sus scrofa)
University Of Chinese Academy Of Sciences
Curated by ChEMBL
LigandPNGBDBM50452895(CHEMBL4206214)
Affinity DataIC50:  6.21E+3nM. Assay description: Inhibition of pig liver microsomal HMG-CoA reductase by colorimetric method
Ligand InfoPC cidPC sid
In DepthDetails ArticlePubMed