BDBM50452932 CHEMBL285166
SMILES [I-].Cn1cc(-c2noc(n2)C2CC[N+](C)(C)CC2)c2ccccc12
InChI Key InChIKey=CGOMZJASWVSSTK-UHFFFAOYSA-M
Data  1 IC50
  Tab Delimited (TSV)   2D SDfile   Computed 3D by Vconf -m prep SDfile
Find this compound or compounds like it in BindingDB:
Activity Spreadsheet -- Enzyme Inhibition Constant Data from BindingDB
Found 1 hit for monomerid = 50452932
Target5-hydroxytryptamine receptor 3A/3B(Rattus norvegicus)
Merck Sharp And Dohme Research Laboratories
Curated by ChEMBL
LigandPNGBDBM50452932(CHEMBL285166)
Affinity DataIC50:  35nM. Assay description: Displacement of [3H]-Q-ICS 205-930 binding to 5-hydroxytryptamine 3 receptor recognition sites in rat brain membranes.
In DepthDetails ArticlePubMed