BDBM50452966 CHEMBL37500
SMILES COc1cccc(c1)-c1noc(n1)C1CN2CCC1CC2
InChI Key InChIKey=AIPRLGDWOLBSDP-UHFFFAOYSA-N
Data  1 IC50
  Tab Delimited (TSV)   2D SDfile   Computed 3D by Vconf -m prep SDfile
Find this compound or compounds like it in BindingDB:
Activity Spreadsheet -- Enzyme Inhibition Constant Data from BindingDB
Found 1 hit for monomerid = 50452966
Target5-hydroxytryptamine receptor 3A/3B(Rattus norvegicus)
Merck Sharp And Dohme Research Laboratories
Curated by ChEMBL
LigandPNGBDBM50452966(CHEMBL37500)
Affinity DataIC50:  13nM. Assay description: Displacement of [3H]-Q-ICS 205-930 binding to 5-hydroxytryptamine 3 receptor recognition sites in rat brain membranes.
In DepthDetails ArticlePubMed