BDBM50453046 CHEMBL2114461
SMILES CCN1CCC[C@@H]1CNC(=O)c1c(O)c(CCCF)cc(OC)c1OC
InChI Key InChIKey=CUVDIPGTXCBTQZ-CQSZACIVSA-N
Data  1 KI
  Tab Delimited (TSV)   2D SDfile   Computed 3D by Vconf -m prep SDfile
Find this compound or compounds like it in BindingDB:
Activity Spreadsheet -- Enzyme Inhibition Constant Data from BindingDB
Found 1 hit for monomerid = 50453046
TargetD(2) dopamine receptor(Rattus norvegicus (rat))
University Of California
Curated by ChEMBL
LigandPNGBDBM50453046(CHEMBL2114461)
Affinity DataKi: >1.00E+4nM. Assay description: Displacement of [3H]- spiperone from dopamine receptor D2 of striatal membranes without sodium chloride
In DepthDetails ArticlePubMed