BDBM50453469 CHEMBL4213574
SMILES COc1ccc(CCCCCCCc2ccc(O)cc2)cc1OC
InChI Key InChIKey=OHZGDEBISOBPKP-UHFFFAOYSA-N
Data  1 IC50
  Tab Delimited (TSV)   2D SDfile   Computed 3D by Vconf -m prep SDfile
Find this compound or compounds like it in BindingDB:
Activity Spreadsheet -- Enzyme Inhibition Constant Data from BindingDB
Found 1 hit for monomerid = 50453469
TargetProstaglandin E synthase(Mus musculus)TBA
LigandPNGBDBM50453469(CHEMBL4213574)
Affinity DataIC50:  2.90E+4nM. Assay description: Inhibition of mPGES1 in mouse 3T3L1 cells assessed as reduction in PGE2 production after 1 hr by ELISA
Ligand InfoPC cidPC sid
In DepthDetails ArticlePubMed