BDBM50453737 CHEMBL4207457
SMILES CC(C)(C)c1ccc(cc1)S(=O)(=O)Oc1ccc(cc1)-c1ccc(Oc2c(Cl)cccc2[N+]([O-])=O)cc1
InChI Key InChIKey=ZVCGRRJKBVKGTG-UHFFFAOYSA-N
Data  1 IC50
  Tab Delimited (TSV)   2D SDfile   Computed 3D by Vconf -m prep SDfile
Find this compound or compounds like it in BindingDB:
Activity Spreadsheet -- Enzyme Inhibition Constant Data from BindingDB
Found 1 hit for monomerid = 50453737
TargetDNA-(apurinic or apyrimidinic site) endonuclease(Homo sapiens (Human))
Russian Academy Of Sciences
Curated by ChEMBL
LigandPNGBDBM50453737(CHEMBL4207457)
Affinity DataIC50:  1.70E+3nM. Assay description: Inhibition of nuclease activity of APE1 in human glioblastoma cells assessed as reduction in AP site DNA cleavage
Ligand InfoPC cidPC sid
In DepthDetails ArticlePubMed