BDBM50454616 CHEMBL2364550
SMILES [H][C@]1(NC(=O)[C@H](CCCN=C(N)N)NC(=O)[C@@H](Cc2ccccc2)NC(=O)[C@H](Cc2c[nH]cn2)NC(=O)[C@H](CC(=O)NCCCC[C@H](NC1=O)C(N)=O)NC(=O)[C@H](CCCC)NC(C)=O)[C@H](C)c1c[nH]c2ccccc12
InChI Key InChIKey=MCTYNMAXUZDSBU-DJPPPKSRSA-N
Data  1 EC50
  Tab Delimited (TSV)   2D SDfile   Computed 3D by Vconf -m prep SDfile
Find this compound or compounds like it in BindingDB:
Activity Spreadsheet -- Enzyme Inhibition Constant Data from BindingDB
Found 1 hit for monomerid = 50454616
TargetMelanocyte-stimulating hormone receptor(Homo sapiens (Human))
University Of Arizona
Curated by ChEMBL
LigandPNGBDBM50454616(CHEMBL2364550)
Affinity DataEC50:  29nM. Assay description: Decrease in frog skin reflectivity (melanotropic activity).
In DepthDetails ArticlePubMed