BDBM50454850 CHEMBL4206582
SMILES [H][C@]1(NC(=O)[C@@H](C)NC(=O)[C@H](CO)NC(=O)[C@H](CCCNC(N)=N)NC(=O)[C@H](CCCNC(N)=N)NC(=O)[C@@]([H])(NC(=O)[C@H](CCCNC(N)=N)NC(=O)[C@@H]2CCCN2C(=O)[C@H](Cc2ccc(O)cc2)NC(=O)CSC[C@H](NC(=O)[C@H](Cc2c[nH]c3ccccc23)NC(=O)[C@H](CCCNC(N)=N)NC1=O)C(N)=O)[C@@H](C)CC)[C@@H](C)CC
InChI Key InChIKey=MLQJIASFGMOPPF-HGVOXRFESA-N
Data  2 IC50  1 Kd  1 EC50
  Tab Delimited (TSV)   2D SDfile   Computed 3D by Vconf -m prep SDfile
Find this compound or compounds like it in BindingDB:
Activity Spreadsheet -- Enzyme Inhibition Constant Data from BindingDB
Found 4 hits for monomerid = 50454850
TargetLysine-specific demethylase 4C(Homo sapiens (Human))
The University Of Tokyo
Curated by ChEMBL
LigandPNGBDBM50454850(CHEMBL4206582)
Affinity DataIC50:  173nM. Assay description: Inhibition of KDM4C (unknown origin) expressed in Escherichia coli using biotinylated peptide as substrate pretreated for 15 mins followed by substra...
Ligand InfoPC cidPC sid
In DepthDetails ArticlePubMed
TargetLysine-specific demethylase 4A(Homo sapiens (Human))
The University Of Tokyo
Curated by ChEMBL
LigandPNGBDBM50454850(CHEMBL4206582)
Affinity DataKd:  14nM. Assay description: Binding affinity to biotinylated-KDM4A (unknown origin) at 300 nM by bio-layer interferometric method
Ligand InfoPC cidPC sid
In DepthDetails ArticlePubMed
TargetLysine-specific demethylase 4A(Homo sapiens (Human))
The University Of Tokyo
Curated by ChEMBL
LigandPNGBDBM50454850(CHEMBL4206582)
Affinity DataEC50: >5.00E+4nM. Assay description: Inhibition of full length FLAG-tagged KDM4A (unknown origin) expressed in human HeLa cells assessed as increase in H3K9me3 levels after 24 hrs by DAP...
Ligand InfoPC cidPC sid
In DepthDetails ArticlePubMed
TargetLysine-specific demethylase 4A(Homo sapiens (Human))
The University Of Tokyo
Curated by ChEMBL
LigandPNGBDBM50454850(CHEMBL4206582)
Affinity DataIC50:  208nM. Assay description: Inhibition of KDM4A (unknown origin) expressed in Escherichia coli using biotinylated peptide as substrate pretreated for 15 mins followed by substra...
Ligand InfoPC cidPC sid
In DepthDetails ArticlePubMed