BDBM50455054 CHEMBL4207451::US10696678, Example 48
SMILES CC1(C)CCc2nc3c(F)cc(cc3n12)-c1nc(Nc2ccc(CN3CCN(CC3)C3CC3)cn2)ncc1F
InChI Key InChIKey=FOHJPPOWZXGQDX-UHFFFAOYSA-N
Data  5 IC50
  Tab Delimited (TSV)   2D SDfile   Computed 3D by Vconf -m prep SDfile
Find this compound or compounds like it in BindingDB:
Activity Spreadsheet -- Enzyme Inhibition Constant Data from BindingDB
Found 5 hits for monomerid = 50455054
TargetCyclin-dependent kinase 4(Homo sapiens (Human))
Beijing University Of Technology
Curated by ChEMBL
LigandPNGBDBM50455054(CHEMBL4207451 | US10696678, Example 48)
Affinity DataIC50:  9.70nM. Assay description: Inhibition of CDK4 (unknown origin) after 90 mins by ADP-Glo assay
Ligand InfoPC cidPC sid
In DepthDetails ArticlePubMed
TargetCyclin-dependent kinase 1/G1/S-specific cyclin-D3(Homo sapiens (Human))
Beijing University Of Technology
Curated by ChEMBL
LigandPNGBDBM50455054(CHEMBL4207451 | US10696678, Example 48)
Affinity DataIC50:  1.87E+3nM. Assay description: Inhibition of recombinant human full length CDK1/Cyclin D3 expressed in baculovirus infected Sf9 insect cells using histone H1 substrate after 90 min...
Ligand InfoPC cidPC sid
In DepthDetails ArticlePubMed
TargetCyclin-dependent kinase 6/G1/S-specific cyclin-D3(Homo sapiens (Human))
Gan & Lee Pharmaceuticals
US Patent
LigandPNGBDBM50455054(CHEMBL4207451 | US10696678, Example 48)
Affinity DataIC50:  1.90E+4nM. Assay description: In vitro inhibition of CDK (CDK1, CDK4, CDK6) activity by compounds of the present invention was tested by the following method.1. Preparation of kin...
Ligand InfoPC cidPC sid
In DepthDetails US Patent
TargetCyclin-dependent kinase 4/G1/S-specific cyclin-D3(Homo sapiens (Human))
Gan & Lee Pharmaceuticals
US Patent
LigandPNGBDBM50455054(CHEMBL4207451 | US10696678, Example 48)
Affinity DataIC50:  9.70E+3nM. Assay description: In vitro inhibition of CDK (CDK1, CDK4, CDK6) activity by compounds of the present invention was tested by the following method.1. Preparation of kin...
Ligand InfoPC cidPC sid
In DepthDetails US Patent
TargetCyclin-dependent kinase 6(Homo sapiens (Human))
Beijing University Of Technology
Curated by ChEMBL
LigandPNGBDBM50455054(CHEMBL4207451 | US10696678, Example 48)
Affinity DataIC50:  19nM. Assay description: Inhibition of recombinant human full length CDK6 expressed in baculovirus infected Sf9 insect cells using histone H1 substrate after 90 mins by ADP-G...
Ligand InfoPC cidPC sid
In DepthDetails ArticlePubMed