BDBM50455061 CHEMBL4211828::US10696678, Example 65
SMILES CC(C)N1CCN(Cc2ccc(Nc3ncc(F)c(n3)-c3cc(F)c4nc5CCC(C)n5c4c3)nc2)CC1
InChI Key InChIKey=JEUQWNQSQIEFOJ-UHFFFAOYSA-N
Data  6 IC50
  Tab Delimited (TSV)   2D SDfile   Computed 3D by Vconf -m prep SDfile
Find this compound or compounds like it in BindingDB:
Activity Spreadsheet -- Enzyme Inhibition Constant Data from BindingDB
Found 6 hits for monomerid = 50455061
TargetCyclin-dependent kinase 1/G1/S-specific cyclin-D3(Homo sapiens (Human))
Beijing University Of Technology
Curated by ChEMBL
LigandPNGBDBM50455061(CHEMBL4211828 | US10696678, Example 65)
Affinity DataIC50:  3.07E+3nM. Assay description: Inhibition of recombinant human full length CDK1/Cyclin D3 expressed in baculovirus infected Sf9 insect cells using histone H1 substrate after 90 min...
Ligand InfoPC cidPC sid
In DepthDetails ArticlePubMed
TargetCyclin-dependent kinase 4(Homo sapiens (Human))
Beijing University Of Technology
Curated by ChEMBL
LigandPNGBDBM50455061(CHEMBL4211828 | US10696678, Example 65)
Affinity DataIC50:  0.600nM. Assay description: Inhibition of CDK4 (unknown origin) after 90 mins by ADP-Glo assay
Ligand InfoPC cidPC sid
In DepthDetails ArticlePubMed
TargetCyclin-A2/Cyclin-dependent kinase 1(Homo sapiens (Human))
Gan & Lee Pharmaceuticals
US Patent
LigandPNGBDBM50455061(CHEMBL4211828 | US10696678, Example 65)
Affinity DataIC50:  3.07E+3nM. Assay description: In vitro inhibition of CDK (CDK1, CDK4, CDK6) activity by compounds of the present invention was tested by the following method.1. Preparation of kin...
Ligand InfoPC cidPC sid
In DepthDetails US Patent
TargetCyclin-dependent kinase 4/G1/S-specific cyclin-D3(Homo sapiens (Human))
Gan & Lee Pharmaceuticals
US Patent
LigandPNGBDBM50455061(CHEMBL4211828 | US10696678, Example 65)
Affinity DataIC50:  600nM. Assay description: In vitro inhibition of CDK (CDK1, CDK4, CDK6) activity by compounds of the present invention was tested by the following method.1. Preparation of kin...
Ligand InfoPC cidPC sid
In DepthDetails US Patent
TargetCyclin-dependent kinase 6/G1/S-specific cyclin-D3(Homo sapiens (Human))
Gan & Lee Pharmaceuticals
US Patent
LigandPNGBDBM50455061(CHEMBL4211828 | US10696678, Example 65)
Affinity DataIC50:  1.27E+4nM. Assay description: In vitro inhibition of CDK (CDK1, CDK4, CDK6) activity by compounds of the present invention was tested by the following method.1. Preparation of kin...
Ligand InfoPC cidPC sid
In DepthDetails US Patent
TargetCyclin-dependent kinase 6(Homo sapiens (Human))
Beijing University Of Technology
Curated by ChEMBL
LigandPNGBDBM50455061(CHEMBL4211828 | US10696678, Example 65)
Affinity DataIC50:  13nM. Assay description: Inhibition of recombinant human full length CDK6 expressed in baculovirus infected Sf9 insect cells using histone H1 substrate after 90 mins by ADP-G...
Ligand InfoPC cidPC sid
In DepthDetails ArticlePubMed