BDBM50455639 CHEMBL2113513
SMILES CCOCCCC#Cc1nc(N)c2ncn([C@@H]3O[C@H](CO)[C@@H](O)[C@H]3O)c2n1
InChI Key InChIKey=BBSNBONOSHEVAM-IWCJZZDYSA-N
Data  2 KI
  Tab Delimited (TSV)   2D SDfile   Computed 3D by Vconf -m prep SDfile
Find this compound or compounds like it in BindingDB:
Activity Spreadsheet -- Enzyme Inhibition Constant Data from BindingDB
Found 2 hits for monomerid = 50455639
TargetAdenosine receptor A2a/A2b(Rattus norvegicus)
Hokkaido University
Curated by ChEMBL
LigandPNGBDBM50455639(CHEMBL2113513)
Affinity DataKi:  13nM. Assay description: Binding affinity against adenosine A2 receptor in rat striatal membranes using [3H]NECA as radioligand
In DepthDetails ArticlePubMed
TargetAdenosine receptor A1(Rattus norvegicus (rat))
Hokkaido University
Curated by ChEMBL
LigandPNGBDBM50455639(CHEMBL2113513)
Affinity DataKi:  244nM. Assay description: Binding affinity against adenosine A1 receptor in rat brain membranes using [3H]CHA as radioligand
In DepthDetails ArticlePubMed