BDBM50455767 CHEMBL4210206
SMILES COc1ccc(cc1)-c1ccc(Sc2ccccc2CC(=O)NO)cc1
InChI Key InChIKey=XZUJPJWGKJJUCO-UHFFFAOYSA-N
Data  5 IC50
  Tab Delimited (TSV)   2D SDfile   Computed 3D by Vconf -m prep SDfile
Find this compound or compounds like it in BindingDB:
Activity Spreadsheet -- Enzyme Inhibition Constant Data from BindingDB
Found 5 hits for monomerid = 50455767
Target72 kDa type IV collagenase(Homo sapiens (Human))
Universit£
Curated by ChEMBL
LigandPNGBDBM50455767(CHEMBL4210206)
Affinity DataIC50:  6.80nM. Assay description: Inhibition of recombinant human MMP-2 using Mca-Lys-Pro-Leu-Gly-Leu-Dap(Dnp)-Ala-Arg-NH2 as substrate preincubated for 3 hrs followed by substrate ad...
Ligand InfoPC cidPC sid
In DepthDetails ArticlePubMed
TargetMatrix metalloproteinase-14(Homo sapiens (Human))
Universit£
Curated by ChEMBL
LigandPNGBDBM50455767(CHEMBL4210206)
Affinity DataIC50:  2.00E+3nM. Assay description: Inhibition of recombinant human MMP-14 catalytic domain using Mca-Lys-Pro-Leu-Gly-Leu-Dap(Dnp)-Ala-Arg-NH2 as substrate preincubated for 3 hrs follow...
Ligand InfoPC cidPC sid
In DepthDetails ArticlePubMed
TargetInterstitial collagenase(Homo sapiens (Human))
Universit£
Curated by ChEMBL
LigandPNGBDBM50455767(CHEMBL4210206)
Affinity DataIC50:  2.50E+5nM. Assay description: Inhibition of recombinant human MMP-1 using Mca-Lys-Pro-Leu-Gly-Leu-Dap(Dnp)-Ala-Arg-NH2 as substrate preincubated for 3 hrs followed by substrate ad...
Ligand InfoPC cidPC sid
In DepthDetails ArticlePubMed
TargetMacrophage metalloelastase(Homo sapiens (Human))
Universit£
Curated by ChEMBL
LigandPNGBDBM50455767(CHEMBL4210206)
Affinity DataIC50:  4nM. Assay description: Inhibition of recombinant human MMP-12 using Mca-Lys-Pro-Leu-Gly-Leu-Dap(Dnp)-Ala-Arg-NH2 as substrate preincubated for 3 hrs followed by substrate a...
Ligand InfoPC cidPC sid
In DepthDetails ArticlePubMed
TargetMatrix metalloproteinase-9(Homo sapiens (Human))
Universit£
Curated by ChEMBL
LigandPNGBDBM50455767(CHEMBL4210206)
Affinity DataIC50:  120nM. Assay description: Inhibition of recombinant human MMP-9 using Mca-Lys-Pro-Leu-Gly-Leu-Dap(Dnp)-Ala-Arg-NH2 as substrate preincubated for 3 hrs followed by substrate ad...
Ligand InfoPC cidPC sid
In DepthDetails ArticlePubMed