BDBM50456265 CHEMBL4212891
SMILES CS(=O)(=O)N1CCN(CC1)C(=O)c1cnc2cc(F)c(F)cc2c1-c1ccc(cc1)C1(CC1)C#N
InChI Key InChIKey=YYGZIDIXCKXQKP-UHFFFAOYSA-N
Data  2 IC50
  Tab Delimited (TSV)   2D SDfile   Computed 3D by Vconf -m prep SDfile
Find this compound or compounds like it in BindingDB:
Activity Spreadsheet -- Enzyme Inhibition Constant Data from BindingDB
Found 2 hits for monomerid = 50456265
TargetAldehyde dehydrogenase 1A1(Homo sapiens (Human))
National Center For Advancing Translational Sciences
Curated by ChEMBL
LigandPNGBDBM50456265(CHEMBL4212891)
Affinity DataIC50:  55nM. Assay description: Inhibition of ALDH1A1 in human MIAPaCa2 cells after 30 mins by aldefluor assay
Ligand InfoPC cidPC sid
In DepthDetails ArticlePubMed
TargetAldehyde dehydrogenase 1A1(Homo sapiens (Human))
National Center For Advancing Translational Sciences
Curated by ChEMBL
LigandPNGBDBM50456265(CHEMBL4212891)
Affinity DataIC50:  8nM. Assay description: Inhibition of human ALDH1A1 using NAD+/propionaldehyde as substrate/cofactor preincubated for 15 mins followed by substrate/cofactor addition measure...
Ligand InfoPC cidPC sid
In DepthDetails ArticlePubMed