BDBM50456584 CHEMBL4213459
SMILES OC(=O)c1cc(on1)-c1ccc(OCc2cn(CCCCCCC(=O)Nc3ccc4cc5ccccc5cc4c3)nn2)cc1C1CCCCC1
InChI Key InChIKey=PQHGVVCKKKBUNY-UHFFFAOYSA-N
Data  1 IC50
  Tab Delimited (TSV)   2D SDfile   Computed 3D by Vconf -m prep SDfile
Find this compound or compounds like it in BindingDB:
Activity Spreadsheet -- Enzyme Inhibition Constant Data from BindingDB
Found 1 hit for monomerid = 50456584
TargetTYR_PHOSPHATASE_2 domain-containing protein(Mycobacterium tuberculosis)
Wuhan University Of Science And Technology
Curated by ChEMBL
LigandPNGBDBM50456584(CHEMBL4213459)
Affinity DataIC50:  170nM. Assay description: Inhibition of Mycobacterium tuberculosis PTPB
Ligand InfoPC cidPC sid
In DepthDetails ArticlePubMed