BDBM50457414 CHEMBL4215390
SMILES CCn1cc(ccc1=O)-n1ncc2cc(O[C@@H]([C@H](C)NC(=O)C(C)(F)F)c3ccccc3)ccc12
InChI Key InChIKey=GFAQUXPHHREEAJ-XDHUDOTRSA-N
Data  2 IC50  1 EC50
  Tab Delimited (TSV)   2D SDfile   Computed 3D by Vconf -m prep SDfile
Find this compound or compounds like it in BindingDB:
Activity Spreadsheet -- Enzyme Inhibition Constant Data from BindingDB
Found 3 hits for monomerid = 50457414
TargetGlucocorticoid receptor(Homo sapiens (Human))
Astrazeneca
Curated by ChEMBL
LigandPNGBDBM50457414(CHEMBL4215390)
Affinity DataIC50:  4.70nM. Assay description: Transrepression activity at glucocorticoid receptor (unknown origin) expressed in human ChaGoK1 cells assessed as inhibition of PMA-stimulated gene e...
Ligand InfoPC cidPC sid
In DepthDetails ArticlePubMed
TargetGlucocorticoid receptor(Homo sapiens (Human))
Astrazeneca
Curated by ChEMBL
LigandPNGBDBM50457414(CHEMBL4215390)
Affinity DataEC50:  13nM. Assay description: Transactivation activity at glucocorticoid receptor (unknown origin) expressed in human ChaGoK1 cells incubated for 24 hrs by beta-galactosidase repo...
Ligand InfoPC cidPC sid
In DepthDetails ArticlePubMed
TargetGlucocorticoid receptor(Homo sapiens (Human))
Astrazeneca
Curated by ChEMBL
LigandPNGBDBM50457414(CHEMBL4215390)
Affinity DataIC50:  2.5nM. Assay description: Displacement of fluormone RED from human full length glucocorticoid receptor after 4 hrs by fluorescence polarization assay
Ligand InfoPC cidPC sid
In DepthDetails ArticlePubMed