BDBM50457816 CHEMBL4215425
SMILES CN1CC[C@@](O)(C#Cc2cccc(c2)-c2cc3ccccc3c(n2)C(N)=O)C1=O
InChI Key InChIKey=BHMWTKSKABRIAP-QHCPKHFHSA-N
Data  1 KI  1 IC50
  Tab Delimited (TSV)   2D SDfile   Computed 3D by Vconf -m prep SDfile
Find this compound or compounds like it in BindingDB:
Activity Spreadsheet -- Enzyme Inhibition Constant Data from BindingDB
Found 2 hits for monomerid = 50457816
TargetMitogen-activated protein kinase kinase kinase 14(Homo sapiens (Human))
Genentech
Curated by ChEMBL
LigandPNGBDBM50457816(CHEMBL4215425)
Affinity DataKi:  0.0700nM. Assay description: Inhibition of NIK (unknown origin) expressed in baculovirus infected insect cells assessed as reduction in hydrolysis of ATP to ADP after 1 to 2 hrs ...
Ligand InfoPC cidPC sid
In DepthDetails ArticlePubMed
TargetMitogen-activated protein kinase kinase kinase 14(Homo sapiens (Human))
Genentech
Curated by ChEMBL
LigandPNGBDBM50457816(CHEMBL4215425)
Affinity DataIC50:  10nM. Assay description: Inhibition of NIK (unknown origin) expressed in HEK293 cells harboring NFkB-Luc assessed as reduction in NFkB signal after 24 hrs by luciferase repor...
Ligand InfoPC cidPC sid
In DepthDetails ArticlePubMed