BDBM50457900 CHEMBL4213017
SMILES COc1cc(-c2ccc(OCCBr)cc2)c(OC)c(O)c1-c1ccc(O)cc1
InChI Key InChIKey=SCYUDLFULVJVJJ-UHFFFAOYSA-N
Data  1 IC50
  Tab Delimited (TSV)   2D SDfile   Computed 3D by Vconf -m prep SDfile
Find this compound or compounds like it in BindingDB:
Activity Spreadsheet -- Enzyme Inhibition Constant Data from BindingDB
Found 1 hit for monomerid = 50457900
TargetProbable maltase-glucoamylase 2(Homo sapiens)
Ocean University Of China
Curated by ChEMBL
LigandPNGBDBM50457900(CHEMBL4213017)
Affinity DataIC50:  1.61E+4nM. Assay description: Inhibition of human alpha-glucosidase expressed in Saccharomyces cerevisiae using p-nitrophenyl-alpha-D-glucopyranoside as substrate after 15 mins
Ligand InfoPC cidPC sid
In DepthDetails ArticlePubMed