BDBM50458283 CHEMBL4212661
SMILES CN(CCc1ccccc1)C[C@@H]1CCN(CCc2c[nH]c3ccc(cc23)-n2cnnc2)C1
InChI Key InChIKey=JGYSWXUWDDXLGJ-QFIPXVFZSA-N
Data  1 IC50
  Tab Delimited (TSV)   2D SDfile   Computed 3D by Vconf -m prep SDfile
Find this compound or compounds like it in BindingDB:
Activity Spreadsheet -- Enzyme Inhibition Constant Data from BindingDB
Found 1 hit for monomerid = 50458283
TargetC-X-C chemokine receptor type 4(Homo sapiens (Human))
Central South University
Curated by ChEMBL
LigandPNGBDBM50458283(CHEMBL4212661)
Affinity DataIC50: >7nM. Assay description: Inhibition of SDF-1 binding to CXCR4 (unknown origin)
Ligand InfoPC cidPC sid
In DepthDetails ArticlePubMed