BDBM50458286 CHEMBL2367715
SMILES C[C@H](NC(=O)[C@H](CCCNC(N)=N)NC(=O)c1ccc(CNCc2ccccn2)cc1)c1cccc2ccccc12
InChI Key InChIKey=UYMDKKVILQGGBT-ZTOMLWHTSA-N
Data  1 IC50
  Tab Delimited (TSV)   2D SDfile   Computed 3D by Vconf -m prep SDfile
Find this compound or compounds like it in BindingDB:
Activity Spreadsheet -- Enzyme Inhibition Constant Data from BindingDB
Found 2 hits for monomerid = 50458286
TargetC-X-C chemokine receptor type 4(Homo sapiens (Human))TBA
LigandPNGBDBM50458286(CHEMBL2367715)
Affinity DataKi:  8.00E+3nM
In DepthDetails
TargetC-X-C chemokine receptor type 4(Homo sapiens (Human))TBA
LigandPNGBDBM50458286(CHEMBL2367715)
Affinity DataIC50:  13nM. Assay description: Displacement of [125I]SDF-1alpha from CXCR4 in human MT4 cells after 2 hrs by scintillation counting analysis
In DepthDetails ArticlePubMed