BDBM50458292 CHEMBL4218011
SMILES Nc1cc(nc(NCc2ccc(CNCCCNC3CCCCC3)cc2)n1)N1CCNCC1
InChI Key InChIKey=YCHGCBUBVUTGJP-UHFFFAOYSA-N
Data  1 IC50
  Tab Delimited (TSV)   2D SDfile   Computed 3D by Vconf -m prep SDfile
Find this compound or compounds like it in BindingDB:
Activity Spreadsheet -- Enzyme Inhibition Constant Data from BindingDB
Found 1 hit for monomerid = 50458292
TargetC-X-C chemokine receptor type 4(Homo sapiens (Human))
Central South University
Curated by ChEMBL
LigandPNGBDBM50458292(CHEMBL4218011)
Affinity DataIC50: <20nM. Assay description: Antagonist activity at CXCR4 (unknown origin)
Ligand InfoPC cidPC sid
In DepthDetails ArticlePubMed