BDBM50458422 CHEMBL4216958
SMILES NC(=O)c1c(NC(=O)COCc2cc(on2)-c2cccs2)sc2CCCCc12
InChI Key InChIKey=NRPUXFKWYPJDFT-UHFFFAOYSA-N
Data  1 IC50
  Tab Delimited (TSV)   2D SDfile   Computed 3D by Vconf -m prep SDfile
Find this compound or compounds like it in BindingDB:
Activity Spreadsheet -- Enzyme Inhibition Constant Data from BindingDB
Found 1 hit for monomerid = 50458422
TargetUbiquitin carboxyl-terminal hydrolase 2(Homo sapiens (Human))
Jagiellonian University
Curated by ChEMBL
LigandPNGBDBM50458422(CHEMBL4216958)
Affinity DataIC50:  3.30E+3nM. Assay description: Inhibition of human USP2a (258 to 605 residues) expressed in Escherichia coli BL21(DE3) using Ub-AMC as substrate incubated for 30 mins measured at 3...
In DepthDetails ArticlePubMed