BDBM50458515 CHEMBL1502738
SMILES [O-][N+](=O)c1ccc(cc1)N(CCCNC(=O)C(F)(F)F)C(=O)CCl
InChI Key InChIKey=RPFLJHUKWQKWPO-UHFFFAOYSA-N
Data  1 IC50
PDB links: 2 PDB IDs match this monomer.
  Tab Delimited (TSV)   2D SDfile   Computed 3D by Vconf -m prep SDfile
Find this compound or compounds like it in BindingDB:
Activity Spreadsheet -- Enzyme Inhibition Constant Data from BindingDB
Found 1 hit for monomerid = 50458515
TargetGlutathione S-transferase omega-1(Homo sapiens (Human))
Monash University
Curated by ChEMBL
LigandPNGBDBM50458515(CHEMBL1502738)
Affinity DataIC50:  28nM. Assay description: Inhibition of GSTO1-1 (unknown origin) by enzymatic assay