BDBM50458519 CHEMBL4211176
SMILES CC(C)CCC[C@@H](C)CCC[C@@H](C)CCC[C@]1(C)CCc2c(C)c(OP(O)(O)=O)c(C)c(C)c2O1
InChI Key InChIKey=JUIUXBHZFNHITF-IEOSBIPESA-N
Data  1 IC50
  Tab Delimited (TSV)   2D SDfile   Computed 3D by Vconf -m prep SDfile
Find this compound or compounds like it in BindingDB:
Activity Spreadsheet -- Enzyme Inhibition Constant Data from BindingDB
Found 1 hit for monomerid = 50458519
TargetGlutathione S-transferase omega-1(Homo sapiens (Human))
Monash University
Curated by ChEMBL
LigandPNGBDBM50458519(CHEMBL4211176)
Affinity DataIC50:  2.00E+3nM. Assay description: Inhibition of human GSTO1-1 by MMA (V) reductase assay
In DepthDetails ArticlePubMed