BDBM50458549 CHEMBL4207983
SMILES CC(C)n1c2ccc(Oc3ncccn3)cc2c2c3CNC(=O)c3c3-c4cn(C)nc4CCc3c12
InChI Key InChIKey=GCRBQBQLMPBGQC-UHFFFAOYSA-N
Data  1 IC50
  Tab Delimited (TSV)   2D SDfile   Computed 3D by Vconf -m prep SDfile
Find this compound or compounds like it in BindingDB:
Activity Spreadsheet -- Enzyme Inhibition Constant Data from BindingDB
Found 1 hit for monomerid = 50458549
TargetProtein delta homolog 1(Homo sapiens (Human))
Genentech
Curated by ChEMBL
LigandPNGBDBM50458549(CHEMBL4207983)
Affinity DataIC50:  1nM. Assay description: Inhibition of DLK (unknown origin) using myelin basic protein as substrate preincubated for 15 mins measured after 30 mins in presence of [gamma-32P]...
Ligand InfoPC cidPC sid
In DepthDetails ArticlePubMed