BDBM50458552 CHEMBL4213135
SMILES C1Cc2[nH]nc(c2CCN1)-c1ccccc1
InChI Key InChIKey=CWCOSSAMGYKZCU-UHFFFAOYSA-N
Data  3 KI
  Tab Delimited (TSV)   2D SDfile   Computed 3D by Vconf -m prep SDfile
Find this compound or compounds like it in BindingDB:
Activity Spreadsheet -- Enzyme Inhibition Constant Data from BindingDB
Found 3 hits for monomerid = 50458552
Target5-hydroxytryptamine receptor 7(Homo sapiens (Human))
Korea Institute Of Science And Technology
Curated by ChEMBL
LigandPNGBDBM50458552(CHEMBL4213135)
Affinity DataKi:  322nM. Assay description: Displacement of [3H]LSD from human 5-HT7 receptor expressed in HEK cell membranes after 1.5 hrs by microbeta scintillation counting method
In DepthDetails ArticlePubMed
Target5-hydroxytryptamine receptor 7(Homo sapiens (Human))
Korea Institute Of Science And Technology
Curated by ChEMBL
LigandPNGBDBM50458552(CHEMBL4213135)
Affinity DataKi:  322nM. Assay description: Human gene recombinant 5-HT7 receptor expressed in Chinese hamster ovary (CHO) cells was used. [3H]LSD 1 nM, the 5-HT7 receptor membrane (15 μg/...
In DepthDetails US Patent
Target5-hydroxytryptamine receptor 7(Homo sapiens (Human))
Korea Institute Of Science And Technology
Curated by ChEMBL
LigandPNGBDBM50458552(CHEMBL4213135)
Affinity DataKi:  324nM. Assay description: Displacement of [3H]LSD from human 5-HT7 receptor expressed in HEK cell membranes after 1.5 hrs by microbeta scintillation counting method
In DepthDetails ArticlePubMed