BDBM50459026 CHEMBL4214902::US10611730, Example 31
SMILES FC(F)(F)Oc1cccc(Cl)c1-c1ccc2[nH]c(=O)[nH]c2c1
InChI Key InChIKey=COBXSLRIXGQVGS-UHFFFAOYSA-N
Data  3 IC50
  Tab Delimited (TSV)   2D SDfile   Computed 3D by Vconf -m prep SDfile
Find this compound or compounds like it in BindingDB:
Activity Spreadsheet -- Enzyme Inhibition Constant Data from BindingDB
Found 3 hits for monomerid = 50459026
TargetGlutamate receptor 1/Voltage-dependent calcium channel gamma-8 subunit(Homo sapiens (Human))
Janssen Research & Development
Curated by ChEMBL
LigandPNGBDBM50459026(CHEMBL4214902 | US10611730, Example 31)
Affinity DataIC50:  10nM. Assay description: Modulation of recombinant human GluA1 flop isoform/TARPgamma8 expressed in HEK293F cells assessed as blockade of glutamate-induced calcium flux by ca...
In DepthDetails ArticlePubMed
TargetVoltage-dependent calcium channel gamma-8 subunit(Homo sapiens (Human))
Janssen Pharmaceutica
US Patent
LigandPNGBDBM50459026(CHEMBL4214902 | US10611730, Example 31)
Affinity DataIC50:  6.31nM. Assay description: This assay was used to test compounds for their ability to inhibit TARP γ8 dependent AMPA receptor activity. The AMPA receptor is a non-selectiv...
In DepthDetails US Patent
TargetGlutamate receptor 1/Voltage-dependent calcium channel gamma-2 subunit(Homo sapiens (Human))
Janssen Research & Development
Curated by ChEMBL
LigandPNGBDBM50459026(CHEMBL4214902 | US10611730, Example 31)
Affinity DataIC50: <1.00E+4nM. Assay description: Modulation of recombinant human GluA1 flop isoform/TARPgamma2 expressed in HEK293F cells assessed as blockade of glutamate-induced calcium flux by ca...
In DepthDetails ArticlePubMed